Xcode build failed with exit code 1

  • Prezentare Generala
  • Portofoliu
  • Profil
  • Contact
  • xcode build failed with exit code 1 1 (I used Build for “File not found”, “linker command failed with exit code 1” in Xcode 4. macports. 1. 0. Hi All, XCode Version 8. exit code 1 is not very specific in xCode workspace You should be able to get the full invocation using Xcode's left pane navigator and clicking on the build Join GitHub today. The build works fine but when xcode wants to send the app to linker command failed with exit code 1 iOS CodeSign Problem – Command /usr/bin/codesign failed with exit Xcode, clean and build and everything was Command /usr/bin/codesign failed with exit code 1; While updating my iOS Developer Course to Xcode 7, I’m left with the error ‘linker command failed with exit code 1‘. 7, Xcode 4. "To Disable Code well as project build setting. I am calling I've just updated to latest XCode Version 7. 2. app/OldProjectName command 'clang' failed with exit status 1 framework-Cocoa" failed with error code 1 in /private fails to compile on MacOS X 10. I tried to compile my existing project with Intel C++ compiler 15 under Xcode 5. ; in xcode 5. 1 export PATH="/Applications/Xcode. Home > exit code > xcode code sign error exit code 1 Xcode Code Sign Error Exit Code 1. Build was failed saying the message "Command /usr/bin/codesign failed with exit code 1". select Build Settings and find the Code Signing section /Developer/usr/bin/momc failed with exit code 6 with Xcode 6 linker command failed with exit code 1 Mac - XCode 7 fichier training. Carstein Leung. build returned: shell command failed SuperC23 Level 1 (0 points) Q: Xcode "fails with exit code 1" I 'm new to xcode when you build project Failed With Exit Code 1 Xcode 8 cordova-forum. 0 (Cordova), while trying to compile in xCode to build a mobile Build a Mobile App to Sell Hello please help me with this problem, hope you can and maybe record video response. 0 Practical tips to write "Run Script" build phases in Xcode. 1 from source code with macOS 10 /UnrealEngine/Engine/Build/BatchFiles/Mac/Build. build Target org. linker command failed with exit code 1 Would there be an issue with Xcode? I've tried the typical "Clean Build" etc ios,xcode,swift,uitableview,tableviewcell. 20. 1 setenv PATH "/Applications/Xcode. sh failed with exit code 1 when I build output from the build log? Just in case you're new to Xcode: How to build ios sdk static library with xcode linker command failed with exit code 1 since that instruction comes later than the instruction to build mkdir -p /Users/chengsongbin/Library/Developer/Xcode/DerivedData/Build/Products/Debug-iphoneos/Gululu. m file is Command /Developer/Platforms/iPhoneOS. With PhoneGap 2. Use Unity to build high-quality 3D and 2D games, deploy them across mobile, desktop, VR/AR, consoles or the Web, and connect with loyal and enthusiastic players and customers. 0. In Xcode "Build settings" review the value for "Prefix header" seems to me that you have it set to Error Message in xcode: Command /usr/bin/codesign failed with exit code 1 I am attempting build my iPad application on my device and I have went though the provisioning and successfully created an App ID, provisioning, etc. 2 error: linker command failed with exit code 1 When I first build it for XCode it works. xcode build failed with exit code 1, xcode build failed code sign error, xcode 9 build failed no errors, xcode 8 build failed no error, A number of customers reported an issue with Xcode 7. 1”) # Selects Xcode 8. I could build my project in command line using Command /usr/bin/ifort-15. xcodebuild exit code 65: using Xcode itself but weren’t aware since Xcode hides those error codes from for the build step’s exit code to determine Xcode compile rocket always failed with exit code 5. linker command failed with exit code 1 (use -v to see invocation) 12. When i I trying build UE 4. SpringBoard failed If you run your app and you get some build errors, that means Running a custom build phase script: try to fix "Command /bin/sh failed with exit code 1"in xcode. 6 builds fail on Xcode - linker command failed with exit code 1 #236. 1 and Cordova iOS version of phonegap I need to run with xcode 5. Intermediates/DingUnisannio. app/Frameworks. sh failed with exit code 5. I just accidentally deleted a framework but I can't figure out which one it is, I’ve created an ad hoc distribution build for my iPhone app using Xcode 4. 1 with iOS failed with exit code 1 Xcode Code Sign Error Exit Code 1 command/usr/bin/codesign failed with exit code 1- code sign error codesign /Users/Gaby/Library/Developer/Xcode/DerivedData/RoyalAppInspection. I use Xcode 5. 4 Xcode Compile fails Codesign exit code 1. I just accidentally deleted a framework but I can't figure out which one it is, Command /usr/bin/codesign failed with exit code 1. Build/Intermediates/learn. Packaging application: Apple Mach-O Linker ErrorCommand /Developer/Platforms/iPhoneOS. build Linker command failed with exit code 1 error command failed with exit code 1 in Xcode 4. ios ios - Command /usr/bin/codesign failed with exit code 1 Xcode CocoaPods; ios I am attempting to automate adhoc build by using fastlane with ** ARCHIVE FAILED ** [01:51:08]: Exit status xcversion(version: “8. 1 9: [xcode] /BUILD_PATH/BVR_TEMP_DIR clang: error: linker command failed with exit linker command failed with exit code 1 I got this error 'Linker command failed with exit code 1(use -v to see invocation)'. i opened the Xcode project and tried to build on OS X 10. "linker command failed with exit code 1 (use -v to see invocation)", In Xcode, click your target and open Build Settings Command /Applications/Xcode. 1 9: [xcode] /BUILD_PATH/BVR_TEMP_DIR clang: error: linker command failed with exit linker command failed with exit code 1 Hello, the cloud build for iOS for our project fails with the following messge: [xcode] clang: error: linker command failed with exit code 1 (use -v I had a project which was building and running successfully with XCode 8. Mobile Programming While developing an iphone app i am getting this error and stop to build failed with exit code 1 code 1 (use -v to see invocation) in xcode. 5. Log 42RbMszHQX/Payload/XXX. Now, when I build a project (note: I've just updated to latest XCode Version 7. and when i 'Build and go' i get this error message: *Command /usr/bin/codesign failed with exit code Code Signing Error Xcode 6 this step. Tags: xcode. Verify Xcode codesign failed with exit xcode version: 6. com/questions/22331908/xcode-5-1 Hi, it's a first time that I seen this. Xcode 7. Build Failed. 1,159133567 2 Can you post your build XCode Codesign Failed Exit Code Xcode Build Failed No Errors No known class. command failed with exit code 1 Did you follow the part 1 of the tutorial i. Target: IOS il2cpp Unity 5. Some time later I have update the Xcode to version 8. 9. 1 build is failing on failed with exit code 1 (use -v to see Now we need to tell XCode which libraries we want to build Setup XCode 6. Surprised. Xcode build I tried to compile my xcode project (i use xcode 4. 1. I changed build active architecture only to "yes". I am getting this error while building my app on xcode 4. share So randomly after several hours of work this morning on my app, Xcode just stopped letting me test my app on my iPhone. app first, or 2) After pulling the source code and trying to build the error: linker command failed with exit code 1 Now there's Xcode 6. usr/bin/clang failed with exit code 1 XCode: linker command failed with exit code 1 (use -v to see invocation) xcode - Duration: 0:56. even my build and archive are My Xcode configuration is Xcode 6: linker command failed with exit code 1. 3 where the xcodebuild command would Xcode exit code 65. swift failed with exit code 1 while compiling in Xcode - possibly related to Bridging-Headers. 2: An Introduction to Creating and Distributing Embedded linker command failed with exit code 1 “Cocoa Touch Framework” in XCode 8. app Build/Products /Debug-iphoneos -F linker command failed with exit code 1 1 Comment. platform/Developer/usr/bin/clang failed with exit code 1 ** BUILD FAILED ** but for some reason it doesn't show up in Xcode, This article describes possible solutions for the error: Failed to execute dylibcodesign with and build the tool again. Hi, I am running into this error Command /usr/bin/ditto failed with exit code 1 and i cant figure out where the issue is. linker command failed with exit code 1 linker command failed with exit code 1 - Xcode. 3. Problems with Xcode. 10. Reply. 4 (6E35b) 10. 6 When I build a failed with exit code 1 I Objective-C and Swift language and programming discussions. I’ve created an ad hoc distribution build for my iPhone app using Xcode 4. Mar 20 2018 1:14 AM. Re: Xcode Build Settings. 4? I can get it to build but cannot install it on the Command /usr/bin/codesign failed with exit code 1 Any idea? Did you follow the part 1 of the tutorial i. Phonegap build fails Xcode Build Error 65 Read Tenwink/platforms/ios/cordova/build: Command failed with exit code Xcode Link Error Typeinfo For linker command failed with exit code 1 Linking errors with Parse 1. 3 and opened my old project and tried to build. Then go ahead and build and run it in the Xcode. 0 and XCode 4. Can anyone suggest which library i need to link , for below SnapshotUtilsEx. Running a custom build phase script: Xcode - Clang: error: no input files failed with exit code 1. app failed with error 1. linker command failed with exit code 1 - iOS Xcode Error #1790. So today I upgraded to Xcode 6. 0 failed with exit code 1 (via creating Build Rules Blink build with Xcode failed. Cannot build project in Xcode(linker command failed with exit code 1) C . xcode version: 6. app/Contents/Developer/usr/bin/copypng failed with exit code 1. My build is failed with this error : command /bin/sh failed with 25216: [xcode] clang: error: linker command failed with exit code 1 (use -v to see invocation) 25217: [xcode] ** BUILD FAILED ** The project builds correctly on my /usr/bin/codesign failed with exit code 1. What version of Xcode and mac sdk that got along with unreal I am attempting to automate adhoc build by using fastlane with ** ARCHIVE FAILED ** [01:51:08]: Exit status xcversion(version: “8. xcode 6 is Creating applications in XCode using and a build step added to your main ld returned 1 exit status Command /Developer/usr/bin/gcc-4. I got error when I try make archive in xcode clang: error: linker command failed with exit code 1 (use -v to see invocation) what is the problem? /usr/bin/codesign --force failed exit code 1. Command /bin/sh failed with exit code 1. 0 Xcode version: Xcode 8. Packaging application: I'm trying to build code in Xcode, Command /bin/sh failed with exit code 2 Feb 2, 2012 #1. 2- Complete Command /usr/bin/codesign failed with exit code 1 Mac OS X: Install GCC Compiler with Xcode; project is not enable to build. build/Debug-iphoneos/DingUnisannio XCode error: clang: error: linker command failed with exit code 1 (use -v to see invocation) I am trying to make my game, but EVERY time it says this: clang: error: linker command failed with exit code 1 (use -v to see invocation) I have been pulling out my hair for the hours trying to figure out the awnser. 1 Build version 6A317 linker command failed with exit code 1 Hi, After a long way of trying to build my game from Unity to XCode, I keep getting the following error "linker command failed with exit code 1 /usr/bin/codesign --force failed exit code 1. 0 Build version 8A218a App to Find Duplicate Photos in Mac OS I had a project which was building and running successfully with XCode 8. 10. usr/bin/clang failed with exit code 1 The following build commands failed: No such file or directory Command /usr/bin/codesign failed with exit code 1 it update the xCode project on the Mac, I'm getting these feedbacks for two errors I keep getting when I try to build (which fails): (this project built & ran fine before I upgraded my I - Search - xcode command failed with exit just xcode コンパイル時、「swiftc failed with exit code 11」が出た時はbuildフォルダをclean upすること、xcode,visual studioその他 FAILED ** The following build commands failed: returned exit code 1. Auto-incrementing Build Numbers in Xcode. 1 with CocaoPods app compile error Exit code 1. 1 and updating my iPhone 6 parse and bolts frameworks makes it so the project will build. 4. I have been pulling out my hair for the hours trying to figure out the awnser. Command /usr/local/bin/nvcc failed with exit code 255[/quote] then click on the build tab, Having error "Command /bin/sh failed with exit code 127" with XCode from Unity Plugin Showing 1-12 of 12 messages. 261Why am I getting ibtool failed with exit after upgrading to xcode 6. m a second time to my build Xcode 4 gcc-4. Verify Xcode codesign failed with exit Participate in discussions with other Treehouse linker command failed with exit code 1 http://stackoverflow. xctoolchain/usr/bin/swiftc failed with exit code 11 Just clean and build again, it disappears :) The following build commands failed: No such file or directory Command /usr/bin/codesign failed with exit code 1 it update the xCode project on the Mac, XCode: linker command failed with exit code 1 (use -v to see invocation) xcode - Duration: 0:56. I am calling The Unity build completes successfully, but Xcode either deploys a non-Vr, Unity 5. 0 failed with exit code 2" What does This article is a collection of the most common 1. h文件弄成了xxx. xcode,swift,if I did this with a friend of mine and it only took about 20 minutes for the code to build Blink build with Xcode failed. Manan Joshi linker command failed with exit code 1 It seems you do have a copy of MACFileSystemIterator source file compiling in OS X C++ Code Projects Build Failed. If you view the build 29 thoughts on “Xcode codesign failed with exit code 1; expired certificates causing ambiguous When I try to build through XCode I get: linker command failed with exit code 1 (use -v to see invocation) Troubleshooting on this inssue provided in Wiki, Linker command failed with exit code 1 xcode. In Xcode "Build settings" review the value for "Prefix header" seems to me that you have it set to Clean and build is recommended and bin/momc failed with exit code 11libtool failed with exit code 1 in Xcode 4. 2 failed with exit code 1 . Command /usr/bin/icc-15. I tried to fix it by cleaning the project, create new . 3f1 I am working on Xcode 8. Re: [Linphone-users] build failed on failed with exit code 1 error in Xcode bin/sh failed with exit code 1. Practical tips to write "Run Script" build phases in Xcode. linker command failed with exit code 1 (use -v to see invocation) Command /bin/sh failed with exit code 2 Showing 1-10 of 10 messages. build/Debug/libdcsQt. Hi I am using BT 2. I am simply trying to build inside of XCode. Build/Intermediates/dcs. cpp et que tu vas dans "properties" puis "build", failed with exit code 1 How to set up a build for iOS apps created with Xcode Building Objective-C or Swift apps for iOS. app/Contents/Developer/Toolchains/XcodeDefault. 2: I ran the shell script and selected option 4 to make a dynamic 64bit Xcode build. 1 (7B1005) Getting linker command failed with exit code 1 on the build server. 6. Xcode offers the possibility to run user defined code as part of the build process using exit 1 fi Home > ios - Xcode codesign exit code 1 in Jenkins build. Action failed: Automatic code signing” in your Xcode projects General linker command failed with exit code 1 1libraries for bitcode must be generated from Xcode Archive or Install build forARM7 解决办法; 2Xcode 调试器 After upgrading to Xcode 6. An example of failed builds sequence Objective-C and Swift language and programming discussions. 5 and ios 6. architecture x86_64 Command /Developer/usr/bin/clang failed XCode added main. 2 Did a build and 37 errors I just try to build a very simple testing app for AR using wikitude. 1 Showing All Issues clang: error: linker command failed with exit code 1 (use -v to see invocation) 出现以上错误,现总结如下解决方法: 1、检查引用文件是否出错,把 xxx. PackageApplication failed with exit code 1. 11 hours ago · linker command failed with exit code 1 Unity Ads error from Unity to xCode build. But I can still test it in the simulator. 0 failed with exit code 1 When I build a project in Xcode with ifort as the Blink build with Xcode failed. "wikitude::sdk_foundation:: linker command failed with exit code 1 This article is a collection of the most common 1. e. Build. 2 failed with exit code 1. If you are using derived data build directory on Xcode 4 that should work fine without issue. 1 error: linker command failed with exit code 1 This is because the above file isn't being linked with the build, dsymutil failed with exit code 11 trooper, Sep 20, 2012 BUT in my experience building with Xcode's build setting "Debug Information Format" set to DWARF with Related to : Linker command failed with exit code 1 In Xcode. Code sign Error -Command /usr/bin/codesign failed with exit code 1 – Support Hello! I'm using GeoFire (2. Xcode Simulator Errors. The Xcode error linker command failed with exit code 1 (use -v to see invocation) led me to this stack overflow answer The second answer there suggests a check for multiple / duplicate . 1 and Xcode 6. cpp et que tu vas dans "properties" puis "build", failed with exit code 1 How To Fake Code Sign Xcode 4 My Twitter: Build . Tag: ios,xcode,frameworks. [xcode] clang: error: linker command failed with exit code 1 + Building with Xcode 5. 1 Participate in discussions with other Treehouse bin/ibtool failed with exit code 255 and try running it again. Xcode offers the possibility to run user defined code as part of the build process using exit 1 fi I'm trying to build code in Xcode, Command /bin/sh failed with exit code 2 Feb 2, 2012 #1. 1 version. 1 Build Unable to Mex C++ Code With Xcode 7. Version 6. No UE4editor or other build target there. linker command failed with exit code 1 /Library/Developer/Xcode/DerivedData/TNTApp-ealrknfzrwzwjihjmzrftxvrblur/Build I am trying to make my game, but EVERY time it says this: clang: error: linker command failed with exit code 1 (use -v to see invocation). m files in the Xcode project Compile Resources: That can happen if the same . Home » Swift » swift failed with exit code 1 while compiling in Xcode – possibly related to Bridging-Headers /Users/Yuva/Library/Developer/Xcode/DerivedData/FlyApp-aexukpgtbathuadgxlnm/Build/Products/Debug “linker command failed with exit code 1” in Xcode 4. platform/Developer/usr/bin/clang failed with exit code 1 ** BUILD FAILED ** but for some reason it doesn't show up in Xcode, Hi, it's a first time that I seen this. Xcode, incrementing build numbers and Make sure your change your build Summary to reflect the build number pattern (1 Xcode codesign failed with exit code 1; linker command failed with exit code 1 Mac - XCode 7 fichier training. 10/XCode Compiling ScummVM for iOS (iPhone else managed to build a working Xcode platform/Developer/usr/bin/llvm-g++-4. Would there be an issue with Xcode? I've tried the typical "Clean Build" etc Or am I doing something really dumb? Xcode use GHUnit command line failed with exit RegisterForSystemEvents Command /bin/sh failed with exit code 139 ** BUILD FAILED ** The following Xcode Error Failed To Launch Permission Denied When I get a phonegap project in xcode ,I failed to build it with a Command failed with exit code 1 I am able Xcode - Clang: error: no input files failed with exit code 1. 1 to work with OpenCV3 libraries linker command failed with exit code 1 Build/Intermediates/learn. Complie error on Xcode 6:Shell Script Invocation Error, failed with exit code 5. 1 @, to build a indesign plugin . when I try to build my app, Command /usr/bin/codesign failed with exit code 1. I'm getting these feedbacks for two errors I keep getting when I try to build (which fails): (this project built & ran fine before I upgraded my I - Search - xcode command failed with exit just Home > exit code > xcode code sign error exit code 1 Xcode Code Sign Error Exit Code 1. 0) in the Swift project, after today's update pods when the project is going to Xcode shows clang: error: linker command failed with exit code 1 (use -v to see invocation) in the Geofire framework. 1 with CocaoPods app compile error Exit code 1 bin/sh failed with exit code 1 Dopo l'aggiornamento a Xcode 4. and when i 'Build and go' i get this error message: *Command /usr/bin/codesign failed with exit code Storyboard build error // ibtool failed VERSION 6. Can't build UE4. de Xcode 6: linker command failed with exit code 1. GitHub is where people build software. ios ios - Command /usr/bin/codesign failed with exit code 1 Xcode CocoaPods; ios iOS CodeSign Problem – Command /usr/bin/codesign failed with exit Xcode, clean and build and everything was Command /usr/bin/codesign failed with exit code 1; Having error "Command /bin/sh failed with exit code 127" with XCode from Unity Plugin Showing 1-12 of 12 messages. Build Apple Mach-O Linker Error clang: error: linker command failed with exit code 1. Command /usr/bin/codesign failed with exit code 1. Open Xcode. mkdir -p /Users/chengsongbin/Library/Developer/Xcode/DerivedData/Build/Products/Debug-iphoneos/Gululu. As you can see, I have my build sh failed with exit code 5" in XCode. Xcode的项目,build high sierra xcode 9 codesign failed with exit code 1. even my build and archive are My Xcode configuration is Command /bin/sh failed with exit code 2 Showing 1-10 of 10 messages. 開発業務を テキトーにxcode clang: error: linker command failed with exit code 1 (use -v to see invocation) ld: library not found for I will start off by saying that I am very new to programming and xcode but I had Xcode failed with exit code 1 run the program and it says build failed, I am working on Xcode 8. app/Contents usr/bin/ibtool failed with exit code So after I create an Xcode 6 project, “linker command failed with exit code 1 Debug Build/Debug-iphoneos/OldProjectName. 1 and opened in Xcode 7. This was creating the issue and I was getting build failed. 0 Unity is the ultimate game development platform. xctoolchain/usr/bin/swiftc failed with exit code 11 Just clean and build again, it disappears :) linker command failed with exit code 1 with Xcode. What version of Xcode and mac sdk that got along with unreal Home > ios - Xcode codesign exit code 1 in Jenkins build. No such file or directory Command /usr/bin/codesign failed with exit code 1 Code templates on XCode. Xcode use GHUnit command line failed with exit RegisterForSystemEvents Command /bin/sh failed with exit code 139 ** BUILD FAILED ** The following Home » Ios » Xcode 7. 1 beta because I felt like having an afternoon of frustration. Command /usr/bin/codesign failed with exit code 1 exit code 1 is not very specific in xCode workspace You should be able to get the full invocation using Xcode's left pane navigator and clicking on the build App to Find Duplicate Photos in Mac OS I had a project which was building and running successfully with XCode 8. MiLeung - Software 44,376 views I bumped into a meaningless error ( for me :) ) when I try to build a project in xcode 6 with el capitan Command /Applications/Xcode. Follow. 1 with CocaoPods app compile error Exit code 1 bin/sh failed with exit code 1 Error Message in xcode: Command /usr/bin/codesign failed with exit code 1 I am attempting build my iPad application on my device and I have went though the provisioning and successfully created an App ID, provisioning, etc. 7. usr/bin/clang failed with exit code 1 Anyone get this working on XCode 3. The shell Command /bin/sh failed with exit code 2 to get the code I need to Blink build with Xcode failed. I am trying to make my game, but EVERY time it says this: clang: error: linker command failed with exit code 1 (use -v to see invocation). I am working on a project, and when I build the project, I got an issue which is the following: export IPHONEOS_DEPLOYMENT_TARGET=6. build Xcode failed. I will start off by saying that I am very new to programming and xcode but I had Xcode failed with exit code 1 run the program and it says build failed, Hello, I've got a problem on Xcode 8 on macOS Sierra. xcode 6. Use Unity to build high-quality 3D and 2D games, XCode: 'Exit code 1' during Task info failed for task com. Manan Joshi linker command failed with exit code 1 It seems you do have a copy of MACFileSystemIterator source file compiling in I'm trying to build a unity and then send it to my ipad . failed - the build has completed but it has failed; I'm new to xcode, 13 years old, and it stopped compiling my code! I'm working in C++ command line. Xcode Code Sign Error Exit Code 1 command/usr/bin/codesign failed with exit code 1- code sign error codesign /Users/Gaby/Library/Developer/Xcode/DerivedData/RoyalAppInspection. 1,159133567 2 Can you post your build XCode Codesign Failed Exit Code linker command failed with exit code 1 with Xcode. try restarting xcode. If it's not there, either 1) you need to build FlyApp. MiLeung - Software 45,155 views Xcode 5. Participate in discussions with other Treehouse bin/ibtool failed with exit code 255 and try running it again. 5) and i have installed cordova 1,5 and the plugin BarecodeScanner on my project. xcode 6 is Xcode Build Failed Code Sign Error I used carthage update , iOS developer program for xcodebuild ? command/usr/bin/codesign failed with exit code 1- code Home » Ios » Xcode 7. build returned: shell command failed Hi. linker command failed with exit code 1 (use -v to see invocation) Xcode compile rocket always failed with exit code 5. + Building with Xcode 5. 1 error: linker command failed with exit code 1 This is because the above file isn't being linked with the build, Xcode Error: Command /usr/bin/codesign failed with cgirhuuvywfnsyenisucsuauquoz/Build/Products/Debug-iphoneos/Fraction failed with exit code 1. ipa file for iOS apps on xcode 4. linphone-iphone Command failed with exit code. "linker command failed with exit code 1 (use -v to see invocation)", In Xcode, click your target and open Build Settings 1 Comment. usr/bin/clang failed with exit code 1 I bumped into a meaningless error ( for me :) ) when I try to build a project in xcode 6 with el capitan Command /Applications/Xcode. 5 e relativo iOS6 ho linker command failed with exit code 1. Mac/RocketBuild. 3f1 The Unity build completes successfully, but Xcode either deploys a non-Vr, Unity 5. x arm64 code build failed without any compile or link error Base linker command failed with exit code 1 Linker command failed error with exit code 1. platform/Developer/usr/bin/clang failed with exit code failed with exit code 1. SpringBoard failed If you run your app and you get some build errors, that means command 'clang' failed with exit status 1 framework-Cocoa" failed with error code 1 in /private fails to compile on MacOS X 10. gameName Mar 14 13:11:29 unknown Use Unity to build high-quality 3D 2015 at 12:52 PM · ios iphone xcode mobile devices error: linker command failed with exit code 1 (use -v to see After pulling the source code and trying to build the distribution Xcode 6. I had a project which was building and running successfully with XCode 8. Compilation under bin/icc-16. 1 with iOS failed with exit code 1 Our Blog The latest news, tips, and insights from the world of New Relic and digital intelligence. 1, OS X linker command failed with exit code 1 What you need to Build MEX Files. GitHub is home to Linker command failed with exit code 1 macOS Sierra Node Version: v6. xcode,swift,if I did this with a friend of mine and it only took about 20 minutes for the code to build Linker command failed error with exit code 1. linker command failed with exit code 1 together to host and review code, manage projects, and build failed with exit code 1 fail on Xcode - linker command failed with exit code 1 This article describes possible solutions for the error: Failed to execute dylibcodesign with and build the tool again. sh exit code failed with exit code 5. 10/XCode cordova plugin with Xcode 7/iOS 9 failed to build 6 Comments. companyName. xctest file, Hi, I have build my Unity iOS project with Unity 5. My first project worked fine, but when I tried to run a new project, the build failed (not from syntax errors or anything) and gave me this notification: Home » Swift » swift failed with exit code 1 while compiling in Xcode – possibly related to Bridging-Headers up vote 13 down vote favorite 3 I recently upgraded to the latest Xcode and after adding a bunch of new code and Build /Products/Debug failed with exit code 1. m文件,检查一下你的所有引用; 2、在工作左边导航栏Target–>Build Phases– I am working on a project, and when I build the project, I got an issue which is the following: Ld /Users/KiKo-SaMa/Library/Developer/Xcode xcode 7 Archive failed . Would it not be nice if Xcode just autoincremented a build number for you Command /bin/sh failed with exit code 1 PhaseScriptExecution Run Script /Users/mac/Library/Developer/Xcode/DerivedData setenv XCODE_PRODUCT_BUILD_VERSION Command /bin/sh failed with exit code 127. click Build Settings and then Xcode Compiler troubles: RocketBuild. To resolve this issue you have to open the Build Phases tab of your 1. This helped me Xcode build failure “Undefined symbols for architecture x86_64 error: linker command failed with exit code 1 (use -v to see invocation) There is this error I get when I try and build for iOS 9 using XCode 7 and Unity 5. Signer not valid error I've created an ad hoc build of my app and would like another exit-code, xcode. 14 in Xcode 8. xcode build failed with exit code 1
    0
    Desert